{"text_format":"1","workbook":"xlsx","n_sheets":15,"sheets":["基礎データ入力","選手Code入力","春Ｓ","春Ｄ","春団","夏Jr.","近予Ｓ","近予Ｄ","秋Ｓ","秋Ｄ","秋団","冬D","県Jr.S","県Jr.D","学校データ"],"not_rendered":{"charts":0,"images":0,"macros":1,"external_links":0,"defined_names":32,"comments":15,"pivot_tables":0},"unopened":[],"bounds":{"document_bytes":16777216,"sheet_cells":100000,"rows_first":2000,"rows_last":500,"rows_between":2000,"halvings":0,"cell_chars":16384,"cell_head_chars":4096},"cells_cut":0,"cells_raw":0,"read":"whole","date_system":"1900"}

{"sheet":"基礎データ入力","index":0,"n_rows":79,"n_cols":3,"rows_kept":79,"cut":false,"hidden":false,"merged":[]}
["本日の日付→",{"$f":"NOW()","v":"2018-03-29T15:46:44.330"}]
[null,"基礎データ入力画面です。\n以下の項目 を入力して下さい。"]
[]
[1,"年度（平成）","入力例"]
[null,30,27]
[]
[2,"学校名（高校の文字は不要です。）","入力例"]
[null,"栗東","石部"]
[]
[3,"所在地"]
["学校データ!へ移動",{"$f":"IF(本校名=\"\",\"\",VLOOKUP(本校名,学校データ!B:E,4,0))","v":"栗東市小野618"},"自動で表示"]
[]
[4,"電話番号"]
[null,{"$f":"IF(本校名=\"\",\"\",VLOOKUP(本校名,学校データ!B:F,5,0))","v":"077-553-3350"}]
[]
{"$rows_left_out":65}
{"sheet":"選手Code入力","index":1,"n_rows":109,"n_cols":17,"rows_kept":109,"cut":false,"hidden":false,"merged":[]}
[]
["※各校でA列に選手コードを、Ｂ列に選手名を値貼り付けして下さい。"]
[]
["選手コード","名前","学年",null,"エントリーコード"]
[201621101,"澤田  希絵",{"$f":"VALUE(MID(E5,1,1))","v":3},{"$f":"A5","v":201621101},{"$f":"VLOOKUP(VALUE(LEFT(A5,4)),$I$6:$M$22,5,0)*100000+VALUE(MID(A5,5,1)*10000)+VALUE(MID(A5,6,1)*1000)+VALUE(MID(A5,7,1)*100)+VALUE(RIGHT(A5,2))","v":321101},null,null,null,"入学年","this year",null,"month","学年",null,null,"学校名","学校コード"]
[201621103,"村田  ゆり子",3,201621103,321103,null,null,null,null,null,null,null,null,null,null,"高島",1]
[201621104,"眞門  有香",3,201621104,321104,null,null,null,2008,{"$f":"IF(L7>=3,YEAR(NOW()),YEAR(NOW())-1)","v":2018},{"$f":"NOW()","v":"2018-03-29T15:46:44.330"},{"$f":"MONTH(K7)","v":3},{"$f":"J7-I7+1","v":11},null,null,"堅田",2]
[201621105,"岸本  璃月稀",3,201621105,321105,null,null,null,2009,2018,"2018-03-29T15:46:44.330",3,10,null,null,"北大津",3]
[201621106,"小寺  楓",3,201621106,321106,null,null,null,2010,2018,"2018-03-29T15:46:44.330",3,9,null,null,"大津商業",4]
[201621107,"山本 詠万",3,201621107,321107,null,null,null,2011,2018,"2018-03-29T15:46:44.330",3,8,null,null,"大津",5]
[201721101,"市川  遥菜",2,201721101,221101,null,null,null,2012,2018,"2018-03-29T15:46:44.330",3,7,null,null,"膳所",6]
[201721102,"加茂　愛奈",2,201721102,221102,null,null,null,2013,2018,"2018-03-29T15:46:44.330",3,6,null,null,"東大津",7]
[201721103,"杉本  彩乃",2,201721103,221103,null,null,null,2014,2018,"2018-03-29T15:46:44.330",3,5,null,null,"玉川",8]
[201721105,"市川  結唯",2,201721105,221105,null,null,null,2015,2018,"2018-03-29T15:46:44.330",3,{"$f":"J14-I14+1","v":4},null,null,"光泉",9]
[201721106,"奥谷  陽奈",2,201721106,221106,null,null,null,2016,2018,"2018-03-29T15:46:44.330",3,3,null,null,"草津",10]
{"$rows_left_out":95}
{"sheet":"春Ｓ","index":2,"n_rows":68,"n_cols":9,"rows_kept":68,"cut":false,"hidden":false,"merged":[[1,1,1,8],[65,1,65,8],[2,1,2,8],[36,1,36,8],[31,1,31,8],[35,1,35,8],[33,3,33,7]]}
[null,null,null,null,null,null,null,{"$f":"VLOOKUP(本校名,選手Code入力!$P$6:$Q$41,2,0)","v":11}]
["編集不可（基礎データ入力！画面で開催年度を更新してください。）　　　→",{"$f":"\"平成\"&年度&\"年度  \"&\"滋賀県春季高校総体ﾃﾆｽ競技大会\"","v":"平成30年度  滋賀県春季高校総体ﾃﾆｽ競技大会"}]
[null,"シングルスの部（　男子　・　女子）参加申込書"]
[]
[null,{"$f":"\"学校名   \"&本校名&\"高等学校\"","v":"学校名   栗東高等学校"},null,null,null,{"$f":"\"顧問名　　　\"&顧問名","v":"顧問名　　　志村　桃"}]
["基礎データ入力へ"]
[null,{"$f":"\"所在地　　　\"&所在地","v":"所在地　　　栗東市小野618"},null,null,null,{"$f":"\"電話番号　\"&電話番号","v":"電話番号　077-553-3350"}]
[null,"記入例"]
[null,3,"中野　忍",2,"秋季ベスト１６",3,210101,"中野　忍","高島"]
[]
[null,"順位","選手氏名","学年","戦績","順位","コード","選手氏名","所属校"]
[null,1,null,{"$f":"IF(ISERROR(VLOOKUP(H12,名前コード,2,0)),\"\",VLOOKUP(H12,名前コード,2,0))","v":""},null,1,{"$f":"IF(C12=\"\",\"\",VLOOKUP(C12,名前,4,0))","v":""},{"$f":"C12","v":0},{"$f":"IF(C12=\"\",\"\",本校名)","v":""}]
[null,2,null,{"$f":"IF(ISERROR(VLOOKUP(H13,名前コード,2,0)),\"\",VLOOKUP(H13,名前コード,2,0))","v":""},null,2,{"$f":"IF(C13=\"\",\"\",VLOOKUP(C13,名前,4,0))","v":""},{"$f":"C13","v":0},{"$f":"IF(C13=\"\",\"\",本校名)","v":""}]
[null,3,null,{"$f":"IF(ISERROR(VLOOKUP(H14,名前コード,2,0)),\"\",VLOOKUP(H14,名前コード,2,0))","v":""},null,3,"",0,""]
[null,4,null,"",null,4,"",0,""]
{"$rows_left_out":54}
{"sheet":"春Ｄ","index":3,"n_rows":90,"n_cols":10,"rows_kept":90,"cut":false,"hidden":false,"merged":[[75,8,76,8],[63,8,64,8],[65,8,66,8],[67,8,68,8],[69,8,70,8],[73,8,74,8],[1,1,1,8],[71,8,72,8],[2,1,2,8],[24,8,25,8],[18,8,19,8],[20,8,21,8],[30,8,31,8],[32,8,33,8],[38,8,39,8],[59,8,60,8],[47,1,47,8],[22,8,23,8],[26,8,27,8],[28,8,29,8],[57,8,58,8],[34,8,35,8],[12,8,13,8],[14,8,15,8],[16,8,17,8],[40,8,41,8],[61,8,62,8],[36,8,37,8],[85,8,86,8],[77,8,78,8],[79,8,80,8],[81,8,82,8],[83,8,84,8]]}
[null,null,null,null,null,null,null,{"$f":"J2","v":11}]
["編集不可（基礎データ入力！画面で開催年度を更新してください。）　　　→",{"$f":"\"平成\"&年度&\"年度  \"&\"滋賀県春季高校総体ﾃﾆｽ競技大会\"","v":"平成30年度  滋賀県春季高校総体ﾃﾆｽ競技大会"},null,null,null,null,null,null,null,{"$f":"VLOOKUP(本校名,選手Code入力!$P$6:$Q$41,2,0)","v":11}]
[null,"ダブルスの部（  男子 ・   女子）参加申込書"]
[]
[null,{"$f":"\"学校名   \"&本校名&\"高等学校\"","v":"学校名   栗東高等学校"},null,null,null,{"$f":"\"顧問名　　　\"&顧問名","v":"顧問名　　　志村　桃"}]
["基礎データ入力へ"]
[null,{"$f":"\"所在地　　　\"&所在地","v":"所在地　　　栗東市小野618"},null,null,null,{"$f":"\"電話番号　\"&電話番号","v":"電話番号　077-553-3350"}]
[null,"記入例"]
[null,3,"中野　忍",2,"秋季ベスト１６",3,210101,"中野　忍","高島"]
[]
[]
[null,"順位","氏名","学年","戦績","順位","ｺｰﾄﾞ","氏名","所属校"]
[null,1,null,{"$f":"IF(ISERROR(VLOOKUP(C13,名前コード,2,0)),\"\",VLOOKUP(C13,名前コード,2,0))","v":""},null,1,{"$f":"IF(C13=\"\",\"\",VLOOKUP(C13,名前,4,0))","v":""},{"$f":"C13","v":0},{"$f":"IF(C13=\"\",\"\",本校名)","v":""}]
[null,null,null,"",null,null,"",{"$f":"C14","v":0}]
[null,2,null,"",null,2,"",{"$f":"C15","v":0},{"$f":"IF(C15=\"\",\"\",本校名)","v":""}]
{"$rows_left_out":76}
{"sheet":"春団","index":4,"n_rows":21,"n_cols":17,"rows_kept":21,"cut":false,"hidden":false,"merged":[[12,1,12,9],[13,1,13,9],[19,0,19,12],[0,0,0,12],[1,0,1,12],[17,0,17,12],[8,1,8,9],[3,0,3,12],[9,1,9,9],[10,1,10,9],[11,1,11,9]]}
[{"$f":"\"平成\"&年度&\"年度　\"&\"滋賀県春季高校総体 テニス競技大会\"","v":"平成30年度　滋賀県春季高校総体 テニス競技大会"},null,null,null,null,null,null,null,null,null,null,null,null,{"$f":"VLOOKUP(本校名,選手Code入力!P6:Q41,2,0)","v":11}]
["団体戦の部（男子・女子）参加申込書"]
[null,null,null,null,null,null,null,null,null,null,null,null,{"$f":"N1","v":11}]
[{"$f":"\"学校名   \"&本校名&\"       高等学校\"","v":"学校名   栗東       高等学校"}]
[{"$f":"\"監督名    \"&harukantoku","v":"監督名    志村　桃"},null,null,null,null,null,null,null,null,null,null,null,null,null,null,null,"↓このボタンを押す（クリックする）と、新規ファイルに値複写されます。"]
[{"$f":"\"所在地  \"&所在地","v":"所在地  栗東市小野618"}]
[{"$f":"\"電話番号  \"&電話番号","v":"電話番号  077-553-3350"}]
[]
["順位","ｺｰﾄﾞ",null,null,null,null,null,null,null,null,"選手氏名","学年","戦績（ポイント）"]
[1,{"$f":"IF(K10=\"\",\"\",VLOOKUP(K10,名前,4,0))","v":""},null,null,null,null,null,null,null,null,null,{"$f":"IF(ISERROR(VLOOKUP(K10,名前コード,2,0)),\"\",VLOOKUP(K10,名前コード,2,0))","v":""}]
[2,{"$f":"IF(K11=\"\",\"\",VLOOKUP(K11,名前,4,0))","v":""},null,null,null,null,null,null,null,null,null,{"$f":"IF(ISERROR(VLOOKUP(K11,名前コード,2,0)),\"\",VLOOKUP(K11,名前コード,2,0))","v":""}]
[3,{"$f":"IF(K12=\"\",\"\",VLOOKUP(K12,名前,4,0))","v":""},null,null,null,null,null,null,null,null,null,{"$f":"IF(ISERROR(VLOOKUP(K12,名前コード,2,0)),\"\",VLOOKUP(K12,名前コード,2,0))","v":""}]
[4,{"$f":"IF(K13=\"\",\"\",VLOOKUP(K13,名前,4,0))","v":""},null,null,null,null,null,null,null,null,null,{"$f":"IF(ISERROR(VLOOKUP(K13,名前コード,2,0)),\"\",VLOOKUP(K13,名前コード,2,0))","v":""}]
[5,{"$f":"IF(K14=\"\",\"\",VLOOKUP(K14,名前,4,0))","v":""},null,null,null,null,null,null,null,null,null,{"$f":"IF(ISERROR(VLOOKUP(K14,名前コード,2,0)),\"\",VLOOKUP(K14,名前コード,2,0))","v":""}]
[]
{"$rows_left_out":7}
{"sheet":"夏Jr.","index":5,"n_rows":31,"n_cols":10,"rows_kept":31,"cut":false,"hidden":false,"merged":[[1,1,1,8],[2,1,2,8],[31,1,31,8],[4,5,4,8],[9,2,9,4]]}
[null,null,null,null,null,null,null,null,{"$f":"J2","v":11}]
["編集不可（基礎データ入力！画面で開催年度を更新してください。）　　　→",{"$f":"\"平成\"&年度&\"年度  \"&\"滋賀県夏季ジュニアテニス選手権大会\"","v":"平成30年度  滋賀県夏季ジュニアテニス選手権大会"},null,null,null,null,null,null,null,{"$f":"VLOOKUP(本校名,選手Code入力!$P$6:$Q$41,2,0)","v":11}]
[null,"１７歳以下　シングルスの部（　男子　・　女子）参加申込書"]
[]
[null,{"$f":"\"学校名   \"&本校名&\"高等学校\"","v":"学校名   栗東高等学校"},null,null,null,{"$f":"\"顧問名　　　\"&顧問名&\" 印\"","v":"顧問名　　　志村　桃 印"}]
["基礎データ入力へ"]
[null,{"$f":"\"所在地　　　\"&所在地","v":"所在地　　　栗東市小野618"},null,null,null,{"$f":"\"電話番号　\"&電話番号","v":"電話番号　077-553-3350"}]
[null,"記入例（未登録選手のデータ＜生年月日含む＞を総務に送信してください。）"]
[null,3,"中野　忍",2,"秋季ベスト１６",3,210199,"中野　忍","高島"]
[null,null,{"$f":"COUNTA(C12:C31)*2600","v":0}]
[null,"順位","選手氏名","学年","戦績","順位","コード","選手氏名","所属校"]
[null,1,null,{"$f":"IF(ISERROR(VLOOKUP(H12,名前コード,2,0)),\"\",VLOOKUP(H12,名前コード,2,0))","v":""},null,1,{"$f":"IF(C12=\"\",\"\",VLOOKUP(C12,名前,4,0))","v":""},{"$f":"C12","v":0},{"$f":"IF(C12=\"\",\"\",本校名&\"高\")","v":""}]
[null,2,null,"",null,2,"",0,""]
[null,3,null,"",null,3,"",0,""]
[null,4,null,"",null,4,"",0,""]
{"$rows_left_out":17}
{"sheet":"近予Ｓ","index":6,"n_rows":102,"n_cols":9,"rows_kept":102,"cut":false,"hidden":false,"merged":[[1,1,1,8],[2,1,2,8],[31,1,31,8],[36,1,36,8],[99,1,99,8],[37,1,37,8],[66,1,66,8],[69,1,69,8],[70,1,70,8],[4,5,4,8],[3,1,4,4]]}
[null,"（兼　県民体育大会高校の部）",null,null,null,null,null,{"$f":"VLOOKUP(本校名,選手Code入力!$P$6:$Q$41,2,0)","v":11}]
["編集不可（基礎データ入力！画面で開催年度を更新してください。）　　　→",{"$f":"\"平成\"&年度&\"年度  \"&\"近畿高校ﾃﾆｽ大会滋賀県予選会\"","v":"平成30年度  近畿高校ﾃﾆｽ大会滋賀県予選会"}]
[null,"シングルスの部（　男子　・　女子）参加申込書"]
[null,{"$f":"\"学校名   \"&本校名&\"高等学校\"","v":"学校名   栗東高等学校"}]
[null,null,null,null,null,{"$f":"\"顧問名  \"&顧問名","v":"顧問名  志村　桃"}]
["基礎データ入力へ"]
[null,{"$f":"\"所在地　　　\"&所在地","v":"所在地　　　栗東市小野618"},null,null,null,{"$f":"\"電話番号　\"&電話番号","v":"電話番号　077-553-3350"}]
[null,"記入例"]
[null,3,"中野　忍",2,"秋季ベスト１６",3,210101,"中野　忍","高島"]
[]
[null,"順位","選手氏名","学年","戦績","順位","コード","選手氏名","所属校"]
[null,1,null,{"$f":"IF(ISERROR(VLOOKUP(H12,名前コード,2,0)),\"\",VLOOKUP(H12,名前コード,2,0))","v":""},null,1,{"$f":"IF(C12=\"\",\"\",VLOOKUP(C12,名前,4,0))","v":""},{"$f":"C12","v":0},{"$f":"IF(C12=\"\",\"\",本校名)","v":""}]
[null,2,null,{"$f":"IF(ISERROR(VLOOKUP(H13,名前コード,2,0)),\"\",VLOOKUP(H13,名前コード,2,0))","v":""},null,2,{"$f":"IF(C13=\"\",\"\",VLOOKUP(C13,名前,4,0))","v":""},{"$f":"C13","v":0},{"$f":"IF(C13=\"\",\"\",本校名)","v":""}]
[null,3,null,{"$f":"IF(ISERROR(VLOOKUP(H14,名前コード,2,0)),\"\",VLOOKUP(H14,名前コード,2,0))","v":""},null,3,"",0,""]
[null,4,null,"",null,4,"",0,""]
{"$rows_left_out":88}
{"sheet":"近予Ｄ","index":7,"n_rows":90,"n_cols":9,"rows_kept":90,"cut":false,"hidden":false,"merged":[[57,8,58,8],[59,8,60,8],[61,8,62,8],[63,8,64,8],[69,8,70,8],[71,8,72,8],[73,8,74,8],[75,8,76,8],[65,8,66,8],[67,8,68,8],[85,8,86,8],[77,8,78,8],[79,8,80,8],[81,8,82,8],[83,8,84,8],[20,8,21,8],[22,8,23,8],[34,8,35,8],[36,8,37,8],[38,8,39,8],[40,8,41,8],[47,1,47,8],[24,8,25,8],[26,8,27,8],[28,8,29,8],[30,8,31,8],[32,8,33,8],[44,4,44,7],[18,8,19,8],[1,1,1,8],[2,1,2,8],[12,8,13,8],[14,8,15,8],[16,8,17,8],[4,5,4,8],[3,1,4,4]]}
[null,"（兼　県民体育大会高校の部）",null,null,null,null,null,{"$f":"VLOOKUP(本校名,選手Code入力!$P$6:$Q$41,2,0)","v":11}]
["編集不可（基礎データ入力！画面で開催年度を更新してください。）　　　→",{"$f":"\"平成\"&年度&\"年度  \"&\"近畿高校ﾃﾆｽ大会滋賀県予選会\"","v":"平成30年度  近畿高校ﾃﾆｽ大会滋賀県予選会"}]
[null,"ダブルスの部（  男子 ・   女子）参加申込書"]
[null,{"$f":"\"学校名   \"&本校名&\"高等学校\"","v":"学校名   栗東高等学校"}]
[null,null,null,null,null,{"$f":"\"顧問名 \"&顧問名","v":"顧問名 志村　桃"}]
["基礎データ入力へ"]
[null,{"$f":"\"所在地　　　\"&所在地","v":"所在地　　　栗東市小野618"},null,null,null,{"$f":"\"電話番号　\"&電話番号","v":"電話番号　077-553-3350"}]
[null,"記入例"]
[null,3,"中野　忍",2,"秋季ベスト１６",3,210101,"中野　忍","高島"]
[]
[]
[null,"順位","氏名","学年","戦績","順位","ｺｰﾄﾞ","氏名","所属校"]
[null,1,null,{"$f":"IF(ISERROR(VLOOKUP(C13,名前コード,2,0)),\"\",VLOOKUP(C13,名前コード,2,0))","v":""},null,1,{"$f":"IF(C13=\"\",\"\",VLOOKUP(C13,名前,4,0))","v":""},{"$f":"C13","v":0},{"$f":"IF(C13=\"\",\"\",本校名)","v":""}]
[null,null,null,{"$f":"IF(ISERROR(VLOOKUP(C14,名前コード,2,0)),\"\",VLOOKUP(C14,名前コード,2,0))","v":""},null,null,{"$f":"IF(C14=\"\",\"\",VLOOKUP(C14,名前,4,0))","v":""},{"$f":"C14","v":0}]
[null,2,null,{"$f":"IF(ISERROR(VLOOKUP(C15,名前コード,2,0)),\"\",VLOOKUP(C15,名前コード,2,0))","v":""},null,2,{"$f":"IF(C15=\"\",\"\",VLOOKUP(C15,名前,4,0))","v":""},{"$f":"C15","v":0},{"$f":"IF(C15=\"\",\"\",本校名)","v":""}]
{"$rows_left_out":76}
{"sheet":"秋Ｓ","index":8,"n_rows":68,"n_cols":10,"rows_kept":68,"cut":false,"hidden":false,"merged":[[36,1,36,8],[65,1,65,8],[1,1,1,8],[2,1,2,8],[31,1,31,8],[35,1,35,8]]}
[]
["編集不可（基礎データ入力！画面で開催年度を更新してください。）　　　→",{"$f":"\"平成\"&年度&\"年度  \"&\"滋賀県秋季高校総体ﾃﾆｽ競技大会\"","v":"平成30年度  滋賀県秋季高校総体ﾃﾆｽ競技大会"},null,null,null,null,null,null,null,{"$f":"VLOOKUP(本校名,選手Code入力!$P$6:$Q$41,2,0)","v":11}]
[null,"シングルスの部（　男子　・　女子）参加申込書"]
[]
[null,{"$f":"\"学校名   \"&本校名&\"高等学校\"","v":"学校名   栗東高等学校"},null,null,null,{"$f":"\"顧問名　　　\"&顧問名","v":"顧問名　　　志村　桃"}]
["基礎データ入力へ"]
[null,{"$f":"\"所在地　　　\"&所在地","v":"所在地　　　栗東市小野618"},null,null,null,{"$f":"\"電話番号　\"&電話番号","v":"電話番号　077-553-3350"}]
[null,"記入例"]
[null,3,"中野　忍",2,"秋季ベスト１６",3,210101,"中野　忍","高島"]
[]
[null,"順位","選手氏名","学年","戦績","順位","コード","選手氏名","所属校"]
[null,1,null,{"$f":"IF(ISERROR(VLOOKUP(H12,名前コード,2,0)),\"\",VLOOKUP(H12,名前コード,2,0))","v":""},null,1,{"$f":"IF(C12=\"\",\"\",VLOOKUP(C12,名前,4,0))","v":""},{"$f":"C12","v":0},{"$f":"IF(C12=\"\",\"\",本校名)","v":""}]
[null,2,null,{"$f":"IF(ISERROR(VLOOKUP(H13,名前コード,2,0)),\"\",VLOOKUP(H13,名前コード,2,0))","v":""},null,2,{"$f":"IF(C13=\"\",\"\",VLOOKUP(C13,名前,4,0))","v":""},{"$f":"C13","v":0},{"$f":"IF(C13=\"\",\"\",本校名)","v":""}]
[null,3,null,{"$f":"IF(ISERROR(VLOOKUP(H14,名前コード,2,0)),\"\",VLOOKUP(H14,名前コード,2,0))","v":""},null,3,"",0,""]
[null,4,null,"",null,4,"",0,""]
{"$rows_left_out":54}
{"sheet":"秋Ｄ","index":9,"n_rows":90,"n_cols":10,"rows_kept":90,"cut":false,"hidden":false,"merged":[[30,8,31,8],[1,1,1,8],[2,1,2,8],[12,8,13,8],[14,8,15,8],[16,8,17,8],[18,8,19,8],[20,8,21,8],[22,8,23,8],[24,8,25,8],[26,8,27,8],[28,8,29,8],[67,8,68,8],[32,8,33,8],[34,8,35,8],[36,8,37,8],[38,8,39,8],[40,8,41,8],[47,1,47,8],[57,8,58,8],[59,8,60,8],[61,8,62,8],[63,8,64,8],[65,8,66,8],[69,8,70,8],[71,8,72,8],[73,8,74,8],[75,8,76,8],[85,8,86,8],[77,8,78,8],[79,8,80,8],[81,8,82,8],[83,8,84,8]]}
[]
["編集不可（基礎データ入力！画面で開催年度を更新してください。）　　　→",{"$f":"\"平成\"&年度&\"年度  \"&\"滋賀県秋季高校総体ﾃﾆｽ競技大会\"","v":"平成30年度  滋賀県秋季高校総体ﾃﾆｽ競技大会"},null,null,null,null,null,null,null,{"$f":"VLOOKUP(本校名,選手Code入力!$P$6:$Q$41,2,0)","v":11}]
[null,"ダブルスの部（  男子 ・   女子）参加申込書"]
[]
[null,{"$f":"\"学校名   \"&本校名&\"高等学校\"","v":"学校名   栗東高等学校"},null,null,null,{"$f":"\"顧問名　　　\"&顧問名","v":"顧問名　　　志村　桃"}]
["基礎データ入力へ"]
[null,{"$f":"\"所在地　　　\"&所在地","v":"所在地　　　栗東市小野618"},null,null,null,{"$f":"\"電話番号　\"&電話番号","v":"電話番号　077-553-3350"}]
[null,"記入例"]
[null,3,"中野　忍",2,"秋季ベスト１６",3,210101,"中野　忍","高島"]
[]
[]
[null,"順位","氏名","学年","戦績","順位","ｺｰﾄﾞ","氏名","所属校"]
[null,1,null,{"$f":"IF(ISERROR(VLOOKUP(C13,名前コード,2,0)),\"\",VLOOKUP(C13,名前コード,2,0))","v":""},null,1,{"$f":"IF(C13=\"\",\"\",VLOOKUP(C13,名前,4,0))","v":""},{"$f":"C13","v":0},{"$f":"IF(C13=\"\",\"\",本校名)","v":""}]
[null,null,null,{"$f":"IF(ISERROR(VLOOKUP(C14,名前コード,2,0)),\"\",VLOOKUP(C14,名前コード,2,0))","v":""},null,null,{"$f":"IF(C14=\"\",\"\",VLOOKUP(C14,名前,4,0))","v":""},{"$f":"C14","v":0}]
[null,2,null,{"$f":"IF(ISERROR(VLOOKUP(C15,名前コード,2,0)),\"\",VLOOKUP(C15,名前コード,2,0))","v":""},null,2,{"$f":"IF(C15=\"\",\"\",VLOOKUP(C15,名前,4,0))","v":""},{"$f":"C15","v":0},{"$f":"IF(C15=\"\",\"\",本校名)","v":""}]
{"$rows_left_out":76}
{"sheet":"秋団","index":10,"n_rows":21,"n_cols":17,"rows_kept":21,"cut":false,"hidden":false,"merged":[[10,1,10,9],[0,0,0,12],[1,0,1,12],[3,0,3,10],[8,1,8,9],[9,1,9,9],[11,1,11,9],[16,1,16,9],[17,1,17,9],[18,0,18,12],[12,1,12,9],[13,1,13,9],[14,1,14,9],[15,1,15,9]]}
[{"$f":"\"平成\"&年度&\"年度  \"&\"滋賀県秋季高校総体テニス競技大会\"","v":"平成30年度  滋賀県秋季高校総体テニス競技大会"}]
["団体戦の部（男子・女子）参加申込書"]
[]
[{"$f":"\"学校名   \"&本校名&\"       高等学校\"","v":"学校名   栗東       高等学校"},null,null,null,null,null,null,null,null,null,null,null,{"$f":"VLOOKUP(本校名,選手Code入力!$P$6:$Q$41,2,0)","v":11}]
[{"$f":"\"監督名    \"&akikantoku","v":"監督名    志村　桃"},null,null,null,null,null,null,null,null,null,null,null,null,null,null,null,"↓このボタンを押す（クリックする）と、新規ファイルに値複写されます。"]
[{"$f":"\"所在地  \"&所在地","v":"所在地  栗東市小野618"}]
[{"$f":"\"電話番号  \"&電話番号","v":"電話番号  077-553-3350"}]
[]
["順位","ｺｰﾄﾞ",null,null,null,null,null,null,null,null,"選手氏名","学年","戦績（ポイント）"]
[1,{"$f":"IF(K10=\"\",\"\",VLOOKUP(K10,名前,4,0))","v":""},null,null,null,null,null,null,null,null,null,{"$f":"IF(ISERROR(VLOOKUP(K10,名前コード,2,0)),\"\",VLOOKUP(K10,名前コード,2,0))","v":""}]
[2,"",null,null,null,null,null,null,null,null,null,{"$f":"IF(ISERROR(VLOOKUP(K11,名前コード,2,0)),\"\",VLOOKUP(K11,名前コード,2,0))","v":""}]
[3,"",null,null,null,null,null,null,null,null,null,{"$f":"IF(ISERROR(VLOOKUP(K12,名前コード,2,0)),\"\",VLOOKUP(K12,名前コード,2,0))","v":""}]
[4,"",null,null,null,null,null,null,null,null,null,{"$f":"IF(ISERROR(VLOOKUP(K13,名前コード,2,0)),\"\",VLOOKUP(K13,名前コード,2,0))","v":""}]
[5,"",null,null,null,null,null,null,null,null,null,""]
[6,"",null,null,null,null,null,null,null,null,null,{"$f":"IF(ISERROR(VLOOKUP(K15,名前コード,2,0)),\"\",VLOOKUP(K15,名前コード,2,0))","v":""}]
{"$rows_left_out":7}
{"sheet":"冬D","index":11,"n_rows":90,"n_cols":9,"rows_kept":90,"cut":false,"hidden":false,"merged":[[9,2,10,2],[47,1,47,8],[1,1,1,8],[2,1,2,8]]}
[null,null,null,null,null,null,null,{"$f":"VLOOKUP(本校名,選手Code入力!$P$6:$Q$41,2,0)","v":11}]
["編集不可（基礎データ入力！画面で開催年度を更新してください。）　　　→",{"$f":"\"平成\"&年度&\"年度  \"&\"滋賀県ウィンターダブルステニス大会\"","v":"平成30年度  滋賀県ウィンターダブルステニス大会"}]
[null,"１７歳以下の部　ダブルスの部（  男子 ・   女子）参加申込書"]
[]
[null,{"$f":"\"学校名   \"&本校名&\"高等学校\"","v":"学校名   栗東高等学校"},null,null,null,{"$f":"\"顧問名　　　\"&顧問名&\" 印\"","v":"顧問名　　　志村　桃 印"}]
["基礎データ入力へ"]
[null,{"$f":"\"所在地　　　\"&所在地","v":"所在地　　　栗東市小野618"},null,null,null,{"$f":"\"電話番号　\"&電話番号","v":"電話番号　077-553-3350"}]
[null,"記入例（未登録選手のデータ＜生年月日含む＞を総務に送信してください。）"]
[null,3,"中野　忍",2,"秋季ベスト１６",3,210101,"中野　忍","高島"]
[null,null,{"$f":"COUNTA(C13:C42)/2*2600","v":0}]
[]
[null,"順位","氏名","学年","戦績","順位","ｺｰﾄﾞ","氏名","所属校"]
[null,1,null,{"$f":"IF(ISERROR(VLOOKUP(C13,名前コード,2,0)),\"\",VLOOKUP(C13,名前コード,2,0))","v":""},null,1,{"$f":"IF(C13=\"\",\"\",VLOOKUP(C13,名前,4,0))","v":""},{"$f":"C13","v":0},{"$f":"IF(C13=\"\",\"\",本校名)","v":""}]
[null,null,null,{"$f":"IF(ISERROR(VLOOKUP(C14,名前コード,2,0)),\"\",VLOOKUP(C14,名前コード,2,0))","v":""},null,null,{"$f":"IF(C14=\"\",\"\",VLOOKUP(C14,名前,4,0))","v":""},{"$f":"C14","v":0},{"$f":"I13","v":""}]
[null,2,null,{"$f":"IF(ISERROR(VLOOKUP(C15,名前コード,2,0)),\"\",VLOOKUP(C15,名前コード,2,0))","v":""},null,2,{"$f":"IF(C15=\"\",\"\",VLOOKUP(C15,名前,4,0))","v":""},{"$f":"C15","v":0},{"$f":"IF(C15=\"\",\"\",本校名)","v":""}]
{"$rows_left_out":76}
{"sheet":"県Jr.S","index":12,"n_rows":31,"n_cols":10,"rows_kept":31,"cut":false,"hidden":false,"merged":[[1,1,1,8],[2,1,2,8],[4,5,4,8],[31,1,31,8],[9,2,9,4]]}
[null,"（兼　関西ジュニアテニス選手権大会滋賀県予選・国体県選考会出場選手決定大会）",null,null,null,null,null,null,{"$f":"J2","v":11}]
["編集不可（基礎データ入力！画面で開催年度を更新してください。）　　　→",{"$f":"\"平成\"&年度&\"年度  \"&\"滋賀県ジュニアテニス選手権大会\"","v":"平成30年度  滋賀県ジュニアテニス選手権大会"},null,null,null,null,null,null,null,{"$f":"VLOOKUP(本校名,選手Code入力!$P$6:$Q$41,2,0)","v":11}]
[null,"18歳以下 シングルスの部（　男子　・　女子）参加申込書"]
[]
[null,{"$f":"\"学校名   \"&本校名&\"高等学校\"","v":"学校名   栗東高等学校"},null,null,null,{"$f":"\"顧問名　　　\"&顧問名&\" 印\"","v":"顧問名　　　志村　桃 印"}]
["基礎データ入力へ"]
[null,{"$f":"\"所在地　　　\"&所在地","v":"所在地　　　栗東市小野618"},null,null,null,{"$f":"\"電話番号　\"&電話番号","v":"電話番号　077-553-3350"}]
[null,"記入例（未登録選手のデータ＜生年月日含む＞を総務に送信してください。）"]
[null,3,"中野　忍",2,"秋季ベスト１６",3,210101,"中野　忍","高島"]
[null,null,{"$f":"COUNTA(C12:C31)*2600","v":0}]
[null,"順位","選手氏名","学年","戦績","順位","コード","選手氏名","所属校"]
[null,1,null,{"$f":"IF(ISERROR(VLOOKUP(H12,名前コード,2,0)),\"\",VLOOKUP(H12,名前コード,2,0))","v":""},null,1,{"$f":"IF(C12=\"\",\"\",VLOOKUP(C12,名前,4,0))","v":""},{"$f":"C12","v":0},{"$f":"IF(C12=\"\",\"\",本校名&\"高\")","v":""}]
[null,2,null,{"$f":"IF(ISERROR(VLOOKUP(H13,名前コード,2,0)),\"\",VLOOKUP(H13,名前コード,2,0))","v":""},null,2,{"$f":"IF(C13=\"\",\"\",VLOOKUP(C13,名前,4,0))","v":""},{"$f":"C13","v":0},""]
[null,3,null,{"$f":"IF(ISERROR(VLOOKUP(H14,名前コード,2,0)),\"\",VLOOKUP(H14,名前コード,2,0))","v":""},null,3,"",0,""]
[null,4,null,"",null,4,"",0,""]
{"$rows_left_out":17}
{"sheet":"県Jr.D","index":13,"n_rows":90,"n_cols":9,"rows_kept":90,"cut":false,"hidden":false,"merged":[[1,1,1,8],[2,1,2,8],[47,1,47,8],[9,2,10,2]]}
[null,"（兼　関西ジュニアテニス選手権大会滋賀県予選・国体県選考会出場選手決定大会）",null,null,null,null,null,{"$f":"VLOOKUP(本校名,選手Code入力!$P$6:$Q$41,2,0)","v":11}]
["編集不可（基礎データ入力！画面で開催年度を更新してください。）　　　→",{"$f":"\"平成\"&年度&\"年度  \"&\"滋賀県ジュニアテニス選手権大会\"","v":"平成30年度  滋賀県ジュニアテニス選手権大会"}]
[null,"18歳以下の部　ダブルスの部（  男子 ・   女子）参加申込書"]
[]
[null,{"$f":"\"学校名   \"&本校名&\"高等学校\"","v":"学校名   栗東高等学校"},null,null,null,{"$f":"\"顧問名　　　\"&顧問名&\" 印\"","v":"顧問名　　　志村　桃 印"}]
["基礎データ入力へ"]
[null,{"$f":"\"所在地　　　\"&所在地","v":"所在地　　　栗東市小野618"},null,null,null,{"$f":"\"電話番号　\"&電話番号","v":"電話番号　077-553-3350"}]
[null,"記入例（未登録選手のデータ＜生年月日含む＞を総務に送信してください。）"]
[null,3,"中野　忍",2,"秋季ベスト１６",3,210101,"中野　忍","高島"]
[null,null,{"$f":"COUNTA(C13:C42)/2*2600","v":0}]
[]
[null,"順位","氏名","学年","戦績","順位","ｺｰﾄﾞ","氏名","所属校"]
[null,1,null,{"$f":"IF(ISERROR(VLOOKUP(C13,名前コード,2,0)),\"\",VLOOKUP(C13,名前コード,2,0))","v":""},null,1,{"$f":"IF(C13=\"\",\"\",VLOOKUP(C13,名前,4,0))","v":""},{"$f":"C13","v":0},{"$f":"IF(C13=\"\",\"\",本校名&\"高\")","v":""}]
[null,null,null,{"$f":"IF(ISERROR(VLOOKUP(C14,名前コード,2,0)),\"\",VLOOKUP(C14,名前コード,2,0))","v":""},null,null,{"$f":"IF(C14=\"\",\"\",VLOOKUP(C14,名前,4,0))","v":""},{"$f":"C14","v":0},""]
[null,2,null,{"$f":"IF(ISERROR(VLOOKUP(C15,名前コード,2,0)),\"\",VLOOKUP(C15,名前コード,2,0))","v":""},null,2,{"$f":"IF(C15=\"\",\"\",VLOOKUP(C15,名前,4,0))","v":""},{"$f":"C15","v":0},""]
{"$rows_left_out":76}
{"sheet":"学校データ","index":14,"n_rows":64,"n_cols":8,"rows_kept":64,"cut":false,"hidden":false,"merged":[]}
["serial #","高等学校名","コード","郵便番号","所在地","℡","FAX"]
[14,"石部",14,"520-3112","湖南市丸山2丁目3-1","0748-77-0311","0748-77-0316","いしべ"]
[24,"伊吹",24,"521-0226","米原市朝日302","0749-55-2350","0749-55-2778","いぶき"]
[17,"愛知",17,"529-1331","愛荘郡愛知川町愛知川102","0749-42-2150","0749-42-6172","えち"]
[21,"近江",21,"522-0002","彦根市松原町大黒前3511-1","0749-22-2323","0749-24-6351","おうみ"]
[4,"大津商業",4,"520-0037","大津市御陵町2-1","077-524-4284","077-526-1802","おおつしょうぎょう"]
[5,"大津",5,"520-0802","大津市馬場一丁目1-1","077-523-0386","077-526-1772","おおつしょうぎょう"]
[2,"堅田",2,"520-0242","大津市本堅田三丁目9-1","077-572-1206","077-573-7075","かたた"]
[3,"北大津",3,"520-0246","大津市仰木の里一丁目23-1","077-573-5881","077-573-7076","きたおおつ"]
[10,"草津",10,"525-0051","草津市木川町955-1","077-562-1220","077-562-5536","くさつ"]
[9,"光泉",9,"525-8566","草津市野路町178","077-564-5600","077-564-5136","こうせｎ"]
[16,"甲南",16,"520-3301","甲賀市甲南町寺庄427","0748-86-4145","0748-86-4983","こうなん"]
[30,"近江兄弟社",31,"523-0851","近江八幡市市井町177","0748-32-3444","0748-32-5316","こうみきょうだいしゃ"]
[12,"国際情報",12,"520-3016","栗東市小野36","077-554-0600","077-554-1539","こくさいじょうほう"]
[54,"滋賀学園",55,"527-0003","東近江市建部北町520-1","0748-23-0858","0748-23-6145","しががくえん"]
{"$rows_left_out":49}